Information card for entry 4342971
Formula | C26.56 H42 F10.32 La N5 O11.68 P1.44 S0.56 |
Calculated formula | C26.559 H42 F10.323 La N5 O11.677 P1.441 S0.559 |
Title of publication | Stabilizing divalent europium in aqueous solution using size-discrimination and electrostatic effects. |
Authors of publication | Regueiro-Figueroa, Martín; Barriada, José Luis; Pallier, Agnès; Esteban-Gómez, David; Blas, Andrés de; Rodríguez-Blas, Teresa; Tóth, Éva; Platas-Iglesias, Carlos |
Journal of publication | Inorganic chemistry |
Year of publication | 2015 |
Journal volume | 54 |
Journal issue | 10 |
Pages of publication | 4940 - 4952 |
a | 22.0177 ± 0.0012 Å |
b | 16.299 ± 0.0008 Å |
c | 10.5443 ± 0.0005 Å |
α | 90° |
β | 97.551 ± 0.002° |
γ | 90° |
Cell volume | 3751.2 ± 0.3 Å3 |
Cell temperature | 100 ± 2 K |
Ambient diffraction temperature | 100 ± 2 K |
Number of distinct elements | 8 |
Space group number | 14 |
Hermann-Mauguin space group symbol | P 1 21/c 1 |
Hall space group symbol | -P 2ybc |
Residual factor for all reflections | 0.0599 |
Residual factor for significantly intense reflections | 0.0345 |
Weighted residual factors for significantly intense reflections | 0.0564 |
Weighted residual factors for all reflections included in the refinement | 0.0626 |
Goodness-of-fit parameter for all reflections included in the refinement | 1.034 |
Diffraction radiation probe | x-ray |
Diffraction radiation wavelength | 0.71073 Å |
Diffraction radiation type | MoKα |