Information card for entry 4342991
Formula | C19 H23 N O2 S2 |
Calculated formula | C19 H23 N O2 S2 |
SMILES | n1c2cccc1COCCSCc1cccc(CSCCOC2)c1 |
Title of publication | Coordination Networks of a Ditopic Macrocycle Exhibiting Anion-Controlled Dimensional Changes and Crystal-to-Crystal Anion Exchange. |
Authors of publication | Lee, Eunji; Park, Ki-Min; Ikeda, Mari; Kuwahara, Shunsuke; Habata, Yoichi; Lee, Shim Sung |
Journal of publication | Inorganic chemistry |
Year of publication | 2015 |
Journal volume | 54 |
Journal issue | 11 |
Pages of publication | 5372 - 5383 |
a | 9.3283 ± 0.0002 Å |
b | 10.2295 ± 0.0002 Å |
c | 10.6795 ± 0.0002 Å |
α | 87.953 ± 0.001° |
β | 71.817 ± 0.001° |
γ | 67.753 ± 0.001° |
Cell volume | 892.17 ± 0.03 Å3 |
Cell temperature | 173 ± 2 K |
Ambient diffraction temperature | 173 ± 2 K |
Number of distinct elements | 5 |
Space group number | 2 |
Hermann-Mauguin space group symbol | P -1 |
Hall space group symbol | -P 1 |
Residual factor for all reflections | 0.0341 |
Residual factor for significantly intense reflections | 0.03 |
Weighted residual factors for significantly intense reflections | 0.0777 |
Weighted residual factors for all reflections included in the refinement | 0.0814 |
Goodness-of-fit parameter for all reflections included in the refinement | 1.032 |
Diffraction radiation wavelength | 0.71073 Å |
Diffraction radiation type | MoKα |