Information card for entry 4342992
Formula | C19 H23 Ag F6 N O2 P S2 |
Calculated formula | C19 H23 Ag F6 N O2 P S2 |
Title of publication | Coordination Networks of a Ditopic Macrocycle Exhibiting Anion-Controlled Dimensional Changes and Crystal-to-Crystal Anion Exchange. |
Authors of publication | Lee, Eunji; Park, Ki-Min; Ikeda, Mari; Kuwahara, Shunsuke; Habata, Yoichi; Lee, Shim Sung |
Journal of publication | Inorganic chemistry |
Year of publication | 2015 |
Journal volume | 54 |
Journal issue | 11 |
Pages of publication | 5372 - 5383 |
a | 11.2267 ± 0.0002 Å |
b | 17.013 ± 0.0003 Å |
c | 12.2564 ± 0.0002 Å |
α | 90° |
β | 108.149 ± 0.001° |
γ | 90° |
Cell volume | 2224.51 ± 0.07 Å3 |
Cell temperature | 173 ± 2 K |
Ambient diffraction temperature | 173 ± 2 K |
Number of distinct elements | 8 |
Space group number | 14 |
Hermann-Mauguin space group symbol | P 1 21/n 1 |
Hall space group symbol | -P 2yn |
Residual factor for all reflections | 0.0453 |
Residual factor for significantly intense reflections | 0.0383 |
Weighted residual factors for significantly intense reflections | 0.0929 |
Weighted residual factors for all reflections included in the refinement | 0.098 |
Goodness-of-fit parameter for all reflections included in the refinement | 1.005 |
Diffraction radiation wavelength | 0.71073 Å |
Diffraction radiation type | MoKα |