Information card for entry 4343019
Common name | Co4-tBu-TEA(R) |
Formula | C120 H148 Co4 N7 O15 |
Calculated formula | C120 H148 Co4 N7 O15 |
Title of publication | A Family of Co(II)Co(III)3 Single-Ion Magnets with Zero-Field Slow Magnetic Relaxation: Fine Tuning of Energy Barrier by Remote Substituent and Counter Cation. |
Authors of publication | Zhu, Yuan-Yuan; Zhang, Yi-Quan; Yin, Ting-Ting; Gao, Chen; Wang, Bing-Wu; Gao, Song |
Journal of publication | Inorganic chemistry |
Year of publication | 2015 |
Journal volume | 54 |
Journal issue | 11 |
Pages of publication | 5475 - 5486 |
a | 16.0739 ± 0.0002 Å |
b | 22.6331 ± 0.0003 Å |
c | 17.3613 ± 0.0002 Å |
α | 90° |
β | 111.303 ± 0.0004° |
γ | 90° |
Cell volume | 5884.52 ± 0.13 Å3 |
Cell temperature | 200 ± 2 K |
Ambient diffraction temperature | 200 ± 2 K |
Number of distinct elements | 5 |
Space group number | 4 |
Hermann-Mauguin space group symbol | P 1 21 1 |
Hall space group symbol | P 2yb |
Residual factor for all reflections | 0.078 |
Residual factor for significantly intense reflections | 0.0437 |
Weighted residual factors for significantly intense reflections | 0.0805 |
Weighted residual factors for all reflections included in the refinement | 0.0882 |
Goodness-of-fit parameter for all reflections included in the refinement | 0.949 |
Diffraction radiation wavelength | 0.71073 Å |
Diffraction radiation type | MoKα |