Information card for entry 4343020
Common name | Co4-Br-DBU(R) |
Formula | C117 H131 Br6 Co4 N14 O18 |
Calculated formula | C117 H131 Br6 Co4 N14 O18 |
SMILES | [Co]123([O]4[Co]567([N](=Cc8c(ccc(Br)c8)O5)[C@@H](C4)c4ccccc4)[N](=Cc4c(ccc(Br)c4)O6)[C@@H](C[O]17)c1ccccc1)([O]1[Co]456([N](=Cc7c(ccc(Br)c7)O4)[C@@H](C1)c1ccccc1)[N](=Cc1c(ccc(Br)c1)O5)[C@@H](C[O]26)c1ccccc1)[O]1[Co]245([N](=Cc6c(ccc(Br)c6)O2)[C@@H](C1)c1ccccc1)[N](=Cc1c(ccc(Br)c1)O4)[C@@H](C[O]35)c1ccccc1.C1CCNC2CCCCC[N+]1=2.C(=O)N(C)C.C(=O)N(C)C.C(=O)N(C)C.C(=O)N(C)C.C(=O)N(C)C.C(=O)N(C)C |
Title of publication | A Family of Co(II)Co(III)3 Single-Ion Magnets with Zero-Field Slow Magnetic Relaxation: Fine Tuning of Energy Barrier by Remote Substituent and Counter Cation. |
Authors of publication | Zhu, Yuan-Yuan; Zhang, Yi-Quan; Yin, Ting-Ting; Gao, Chen; Wang, Bing-Wu; Gao, Song |
Journal of publication | Inorganic chemistry |
Year of publication | 2015 |
Journal volume | 54 |
Journal issue | 11 |
Pages of publication | 5475 - 5486 |
a | 12.78 ± 0.003 Å |
b | 19.188 ± 0.004 Å |
c | 47.313 ± 0.01 Å |
α | 90° |
β | 90° |
γ | 90° |
Cell volume | 11602 ± 4 Å3 |
Cell temperature | 173 ± 2 K |
Ambient diffraction temperature | 173 ± 2 K |
Number of distinct elements | 6 |
Space group number | 19 |
Hermann-Mauguin space group symbol | P 21 21 21 |
Hall space group symbol | P 2ac 2ab |
Residual factor for all reflections | 0.1152 |
Residual factor for significantly intense reflections | 0.0929 |
Weighted residual factors for significantly intense reflections | 0.227 |
Weighted residual factors for all reflections included in the refinement | 0.2514 |
Goodness-of-fit parameter for all reflections included in the refinement | 1.189 |
Diffraction radiation wavelength | 0.71073 Å |
Diffraction radiation type | MoKα |