Information card for entry 4343051
Formula | C127 H134 Cl4 Cu2 N2 P6 S6 Si6 |
Calculated formula | C127 H134 Cl4 Cu2 N2 P6 S6 Si6 |
Title of publication | Ambient Stable Trigonal Bipyramidal Copper(III) Complexes Equipped with an Exchangeable Axial Ligand. |
Authors of publication | Chang, Hao-Ching; Lo, Feng-Chun; Liu, Wen-Chi; Lin, Tsung-Han; Liaw, Wen-Feng; Kuo, Ting-Shen; Lee, Way-Zen |
Journal of publication | Inorganic chemistry |
Year of publication | 2015 |
Journal volume | 54 |
Journal issue | 11 |
Pages of publication | 5527 - 5533 |
a | 11.4117 ± 0.0005 Å |
b | 15.4422 ± 0.0006 Å |
c | 21.9728 ± 0.0009 Å |
α | 98.225 ± 0.002° |
β | 98.85 ± 0.003° |
γ | 110.687 ± 0.003° |
Cell volume | 3496.7 ± 0.3 Å3 |
Cell temperature | 200 ± 2 K |
Ambient diffraction temperature | 200 ± 2 K |
Number of distinct elements | 8 |
Space group number | 2 |
Hermann-Mauguin space group symbol | P -1 |
Hall space group symbol | -P 1 |
Residual factor for all reflections | 0.163 |
Residual factor for significantly intense reflections | 0.0783 |
Weighted residual factors for significantly intense reflections | 0.1916 |
Weighted residual factors for all reflections included in the refinement | 0.2198 |
Goodness-of-fit parameter for all reflections included in the refinement | 0.974 |
Diffraction radiation wavelength | 0.71073 Å |
Diffraction radiation type | MoKα |