Information card for entry 4343052
Formula | C63.5 H67 Cl Cu N4 P3 S3 Si3 |
Calculated formula | C63.5 H67 Cl Cu N4 P3 S3 Si3 |
Title of publication | Ambient Stable Trigonal Bipyramidal Copper(III) Complexes Equipped with an Exchangeable Axial Ligand. |
Authors of publication | Chang, Hao-Ching; Lo, Feng-Chun; Liu, Wen-Chi; Lin, Tsung-Han; Liaw, Wen-Feng; Kuo, Ting-Shen; Lee, Way-Zen |
Journal of publication | Inorganic chemistry |
Year of publication | 2015 |
Journal volume | 54 |
Journal issue | 11 |
Pages of publication | 5527 - 5533 |
a | 14.7323 ± 0.001 Å |
b | 15.12 ± 0.0014 Å |
c | 18.1122 ± 0.0016 Å |
α | 75.436 ± 0.004° |
β | 83.822 ± 0.004° |
γ | 66.337 ± 0.004° |
Cell volume | 3576.5 ± 0.5 Å3 |
Cell temperature | 200 ± 2 K |
Ambient diffraction temperature | 200 ± 2 K |
Number of distinct elements | 8 |
Space group number | 2 |
Hermann-Mauguin space group symbol | P -1 |
Hall space group symbol | -P 1 |
Residual factor for all reflections | 0.0888 |
Residual factor for significantly intense reflections | 0.062 |
Weighted residual factors for significantly intense reflections | 0.1745 |
Weighted residual factors for all reflections included in the refinement | 0.1894 |
Goodness-of-fit parameter for all reflections included in the refinement | 1.062 |
Diffraction radiation wavelength | 0.71073 Å |
Diffraction radiation type | MoKα |