Information card for entry 4343075
Formula | C114.5 H160 Fe2 K2 N4 O20 U2 |
Calculated formula | C114.5 H160 Fe2 K2 N4 O20 U2 |
Title of publication | Ferrocene-Based Tetradentate Schiff Bases as Supporting Ligands in Uranium Chemistry. |
Authors of publication | Camp, Clément; Chatelain, Lucile; Mougel, Victor; Pécaut, Jacques; Mazzanti, Marinella |
Journal of publication | Inorganic chemistry |
Year of publication | 2015 |
Journal volume | 54 |
Journal issue | 12 |
Pages of publication | 5774 - 5783 |
a | 13.4971 ± 0.0003 Å |
b | 21.8515 ± 0.0005 Å |
c | 22.1835 ± 0.0004 Å |
α | 106.294 ± 0.0018° |
β | 106.678 ± 0.0018° |
γ | 92.5543 ± 0.0019° |
Cell volume | 5959.7 ± 0.2 Å3 |
Cell temperature | 150 ± 2 K |
Ambient diffraction temperature | 150 ± 2 K |
Number of distinct elements | 7 |
Space group number | 2 |
Hermann-Mauguin space group symbol | P -1 |
Hall space group symbol | -P 1 |
Residual factor for all reflections | 0.1234 |
Residual factor for significantly intense reflections | 0.0569 |
Weighted residual factors for significantly intense reflections | 0.1071 |
Weighted residual factors for all reflections included in the refinement | 0.129 |
Goodness-of-fit parameter for all reflections included in the refinement | 1 |
Diffraction radiation wavelength | 0.71073 Å |
Diffraction radiation type | MoKα |