Information card for entry 4343076
Chemical name | Olex2 1.1 (compiled 2011.11.01 svn.r2039, GUI svn.r3906) |
Formula | C52 H44 Fe2 N4 O5 U |
Calculated formula | C52 H44 Fe2 N4 O5 U |
Title of publication | Ferrocene-Based Tetradentate Schiff Bases as Supporting Ligands in Uranium Chemistry. |
Authors of publication | Camp, Clément; Chatelain, Lucile; Mougel, Victor; Pécaut, Jacques; Mazzanti, Marinella |
Journal of publication | Inorganic chemistry |
Year of publication | 2015 |
Journal volume | 54 |
Journal issue | 12 |
Pages of publication | 5774 - 5783 |
a | 13.6625 ± 0.0004 Å |
b | 14.8238 ± 0.0003 Å |
c | 22.5571 ± 0.0005 Å |
α | 90° |
β | 107.265 ± 0.003° |
γ | 90° |
Cell volume | 4362.6 ± 0.2 Å3 |
Cell temperature | 150 ± 2 K |
Ambient diffraction temperature | 150 ± 2 K |
Number of distinct elements | 6 |
Space group number | 14 |
Hermann-Mauguin space group symbol | P 1 21/n 1 |
Hall space group symbol | -P 2yn |
Residual factor for all reflections | 0.0443 |
Residual factor for significantly intense reflections | 0.0355 |
Weighted residual factors for significantly intense reflections | 0.0763 |
Weighted residual factors for all reflections included in the refinement | 0.0802 |
Goodness-of-fit parameter for all reflections included in the refinement | 1.083 |
Diffraction radiation wavelength | 0.71073 Å |
Diffraction radiation type | MoKα |