Information card for entry 4343080
Formula | C42 H45 B5 Bi N2 O6.5 |
Calculated formula | C42 H45 B5 Bi N2 O6.5 |
Title of publication | From Stiba- and Bismaheteroboroxines to N,C,N-Chelated Diorganoantimony(III) and Bismuth(III) Cations-An Unexpected Case of Aryl Group Migration. |
Authors of publication | Dostál, Libor; Jambor, Roman; Růžička, Aleš; Jirásko, Robert; Lyčka, Antonín; Beckmann, Jens; Ketkov, Sergey |
Journal of publication | Inorganic chemistry |
Year of publication | 2015 |
Journal volume | 54 |
Journal issue | 12 |
Pages of publication | 6010 - 6019 |
a | 12.571 ± 0.001 Å |
b | 14.106 ± 0.001 Å |
c | 23.25 ± 0.003 Å |
α | 90° |
β | 90° |
γ | 90° |
Cell volume | 4122.8 ± 0.7 Å3 |
Cell temperature | 150 ± 1 K |
Ambient diffraction temperature | 150 ± 1 K |
Number of distinct elements | 6 |
Space group number | 19 |
Hermann-Mauguin space group symbol | P 21 21 21 |
Hall space group symbol | P 2ac 2ab |
Residual factor for all reflections | 0.0433 |
Residual factor for significantly intense reflections | 0.0328 |
Weighted residual factors for significantly intense reflections | 0.0638 |
Weighted residual factors for all reflections included in the refinement | 0.0695 |
Goodness-of-fit parameter for all reflections included in the refinement | 1.123 |
Diffraction radiation wavelength | 0.71073 Å |
Diffraction radiation type | MoKα |