Information card for entry 4343079
Formula | C42 H44 B5 N2 O6 Sb |
Calculated formula | C42 H44 B5 N2 O6 Sb |
SMILES | [Sb]12(c3c(cccc3C[N]2(C)C)C[N]1(C)C)c1ccccc1.O1B(OB(O[B]21OB(OB(O2)c1ccccc1)c1ccccc1)c1ccccc1)c1ccccc1 |
Title of publication | From Stiba- and Bismaheteroboroxines to N,C,N-Chelated Diorganoantimony(III) and Bismuth(III) Cations-An Unexpected Case of Aryl Group Migration. |
Authors of publication | Dostál, Libor; Jambor, Roman; Růžička, Aleš; Jirásko, Robert; Lyčka, Antonín; Beckmann, Jens; Ketkov, Sergey |
Journal of publication | Inorganic chemistry |
Year of publication | 2015 |
Journal volume | 54 |
Journal issue | 12 |
Pages of publication | 6010 - 6019 |
a | 12.391 ± 0.0008 Å |
b | 14.207 ± 0.0009 Å |
c | 23.1981 ± 0.0017 Å |
α | 90° |
β | 90° |
γ | 90° |
Cell volume | 4083.8 ± 0.5 Å3 |
Cell temperature | 150 ± 1 K |
Ambient diffraction temperature | 150 ± 1 K |
Number of distinct elements | 6 |
Space group number | 19 |
Hermann-Mauguin space group symbol | P 21 21 21 |
Hall space group symbol | P 2ac 2ab |
Residual factor for all reflections | 0.044 |
Residual factor for significantly intense reflections | 0.0334 |
Weighted residual factors for significantly intense reflections | 0.0573 |
Weighted residual factors for all reflections included in the refinement | 0.0618 |
Goodness-of-fit parameter for all reflections included in the refinement | 1.154 |
Diffraction radiation wavelength | 0.71073 Å |
Diffraction radiation type | MoKα |