Information card for entry 4343111
Formula | C40.5 H67 Cl N2 Ni O3 Si2 |
Calculated formula | C40.5 H67 Cl N2 Ni O3 Si2 |
Title of publication | Charge and Spin States in Schiff Base Metal Complexes with a Disiloxane Unit Exhibiting a Strong Noninnocent Ligand Character: Synthesis, Structure, Spectroelectrochemistry, and Theoretical Calculations. |
Authors of publication | Cazacu, Maria; Shova, Sergiu; Soroceanu, Alina; Machata, Peter; Bucinsky, Lukas; Breza, Martin; Rapta, Peter; Telser, Joshua; Krzystek, J.; Arion, Vladimir B. |
Journal of publication | Inorganic chemistry |
Year of publication | 2015 |
Journal volume | 54 |
Journal issue | 12 |
Pages of publication | 5691 - 5706 |
a | 9.4256 ± 0.0006 Å |
b | 30.342 ± 0.019 Å |
c | 16.672 ± 0.003 Å |
α | 90° |
β | 100.734 ± 0.008° |
γ | 90° |
Cell volume | 4685 ± 3 Å3 |
Cell temperature | 200 ± 0.1 K |
Ambient diffraction temperature | 200 ± 0.1 K |
Number of distinct elements | 7 |
Space group number | 14 |
Hermann-Mauguin space group symbol | P 1 21/n 1 |
Hall space group symbol | -P 2yn |
Residual factor for all reflections | 0.1079 |
Residual factor for significantly intense reflections | 0.0689 |
Weighted residual factors for significantly intense reflections | 0.1663 |
Weighted residual factors for all reflections included in the refinement | 0.1837 |
Goodness-of-fit parameter for all reflections included in the refinement | 1.039 |
Diffraction radiation wavelength | 0.71073 Å |
Diffraction radiation type | MoKα |