Information card for entry 4343112
Formula | C40 H66 Cu N2 O3 Si2 |
Calculated formula | C40 H66 Cu N2 O3 Si2 |
Title of publication | Charge and Spin States in Schiff Base Metal Complexes with a Disiloxane Unit Exhibiting a Strong Noninnocent Ligand Character: Synthesis, Structure, Spectroelectrochemistry, and Theoretical Calculations. |
Authors of publication | Cazacu, Maria; Shova, Sergiu; Soroceanu, Alina; Machata, Peter; Bucinsky, Lukas; Breza, Martin; Rapta, Peter; Telser, Joshua; Krzystek, J.; Arion, Vladimir B. |
Journal of publication | Inorganic chemistry |
Year of publication | 2015 |
Journal volume | 54 |
Journal issue | 12 |
Pages of publication | 5691 - 5706 |
a | 14.2195 ± 0.0012 Å |
b | 19.482 ± 0.003 Å |
c | 17.222 ± 0.002 Å |
α | 90° |
β | 110.435 ± 0.012° |
γ | 90° |
Cell volume | 4470.7 ± 1 Å3 |
Cell temperature | 293 ± 2 K |
Ambient diffraction temperature | 293 ± 2 K |
Number of distinct elements | 6 |
Space group number | 14 |
Hermann-Mauguin space group symbol | P 1 21/n 1 |
Hall space group symbol | -P 2yn |
Residual factor for all reflections | 0.1184 |
Residual factor for significantly intense reflections | 0.0666 |
Weighted residual factors for significantly intense reflections | 0.1564 |
Weighted residual factors for all reflections included in the refinement | 0.1795 |
Goodness-of-fit parameter for all reflections included in the refinement | 1.054 |
Diffraction radiation wavelength | 0.71073 Å |
Diffraction radiation type | MoKα |