Information card for entry 4343116
Formula | C16 H22 Ca N2 O8 |
Calculated formula | C16 H22 Ca N2 O8 |
Title of publication | Alkaline Earth Metal Ion/Dihydroxy-Terephthalate MOFs: Structural Diversity and Unusual Luminescent Properties. |
Authors of publication | Douvali, Antigoni; Papaefstathiou, Giannis S.; Gullo, Maria Pia; Barbieri, Andrea; Tsipis, Athanassios C.; Malliakas, Christos D.; Kanatzidis, Mercouri G.; Papadas, Ioannis; Armatas, Gerasimos S.; Hatzidimitriou, Antonios G.; Lazarides, Theodore; Manos, Manolis J. |
Journal of publication | Inorganic chemistry |
Year of publication | 2015 |
Journal volume | 54 |
Journal issue | 12 |
Pages of publication | 5813 - 5826 |
a | 18.659 ± 0.004 Å |
b | 11.251 ± 0.002 Å |
c | 10.015 ± 0.002 Å |
α | 90° |
β | 114.12 ± 0.03° |
γ | 90° |
Cell volume | 1918.9 ± 0.8 Å3 |
Cell temperature | 298 ± 2 K |
Ambient diffraction temperature | 298 ± 2 K |
Number of distinct elements | 5 |
Space group number | 15 |
Hermann-Mauguin space group symbol | C 1 2/c 1 |
Hall space group symbol | -C 2yc |
Residual factor for all reflections | 0.0596 |
Residual factor for significantly intense reflections | 0.0397 |
Weighted residual factors for significantly intense reflections | 0.12 |
Weighted residual factors for all reflections included in the refinement | 0.142 |
Goodness-of-fit parameter for all reflections included in the refinement | 1.11 |
Diffraction radiation wavelength | 0.71073 Å |
Diffraction radiation type | MoKα |