Information card for entry 4343117
Formula | C48 H68 N6 O25 Sr3 |
Calculated formula | C48 H68 N6 O25 Sr3 |
Title of publication | Alkaline Earth Metal Ion/Dihydroxy-Terephthalate MOFs: Structural Diversity and Unusual Luminescent Properties. |
Authors of publication | Douvali, Antigoni; Papaefstathiou, Giannis S.; Gullo, Maria Pia; Barbieri, Andrea; Tsipis, Athanassios C.; Malliakas, Christos D.; Kanatzidis, Mercouri G.; Papadas, Ioannis; Armatas, Gerasimos S.; Hatzidimitriou, Antonios G.; Lazarides, Theodore; Manos, Manolis J. |
Journal of publication | Inorganic chemistry |
Year of publication | 2015 |
Journal volume | 54 |
Journal issue | 12 |
Pages of publication | 5813 - 5826 |
a | 11.439 ± 0.005 Å |
b | 11.966 ± 0.005 Å |
c | 12.113 ± 0.005 Å |
α | 101.036 ± 0.005° |
β | 106.89 ± 0.005° |
γ | 107.95 ± 0.005° |
Cell volume | 1435.6 ± 1.1 Å3 |
Cell temperature | 293 ± 2 K |
Ambient diffraction temperature | 293 ± 2 K |
Number of distinct elements | 5 |
Space group number | 2 |
Hermann-Mauguin space group symbol | P -1 |
Hall space group symbol | -P 1 |
Residual factor for all reflections | 0.072 |
Residual factor for significantly intense reflections | 0.0368 |
Weighted residual factors for significantly intense reflections | 0.1102 |
Weighted residual factors for all reflections included in the refinement | 0.1352 |
Goodness-of-fit parameter for all reflections included in the refinement | 1.154 |
Diffraction radiation wavelength | 0.71073 Å |
Diffraction radiation type | MoKα |