Information card for entry 4343202
Formula | C37 H46 Cl Ge N2 P S2 |
Calculated formula | C37 H46 Cl Ge N2 P S2 |
Title of publication | Reactivity of Germylene toward Phosphorus-Containing Compounds: Nucleophilic Addition and Tautomerism. |
Authors of publication | Wu, Yile; Liu, Liu; Su, Jue; Yan, Kaili; Wang, Tao; Zhu, Jun; Gao, Xiang; Gao, Yuxing; Zhao, Yufen |
Journal of publication | Inorganic chemistry |
Year of publication | 2015 |
Journal volume | 54 |
Journal issue | 9 |
Pages of publication | 4423 - 4430 |
a | 9.967 ± 0.003 Å |
b | 23.28 ± 0.008 Å |
c | 16.488 ± 0.005 Å |
α | 90° |
β | 101.938 ± 0.006° |
γ | 90° |
Cell volume | 3743 ± 2 Å3 |
Cell temperature | 273 ± 2 K |
Ambient diffraction temperature | 273 ± 2 K |
Number of distinct elements | 7 |
Space group number | 14 |
Hermann-Mauguin space group symbol | P 1 21/n 1 |
Hall space group symbol | -P 2yn |
Residual factor for all reflections | 0.0447 |
Residual factor for significantly intense reflections | 0.038 |
Weighted residual factors for significantly intense reflections | 0.1044 |
Weighted residual factors for all reflections included in the refinement | 0.1077 |
Goodness-of-fit parameter for all reflections included in the refinement | 1.06 |
Diffraction radiation wavelength | 0.71073 Å |
Diffraction radiation type | MoKα |