Information card for entry 4343203
Formula | C41 H51 Ge N2 O P |
Calculated formula | C41 H51 Ge N2 O P |
SMILES | [Ge]1(OP(c2ccccc2)c2ccccc2)[N](c2c(cccc2C(C)C)C(C)C)=C(C=C(N1c1c(cccc1C(C)C)C(C)C)C)C |
Title of publication | Reactivity of Germylene toward Phosphorus-Containing Compounds: Nucleophilic Addition and Tautomerism. |
Authors of publication | Wu, Yile; Liu, Liu; Su, Jue; Yan, Kaili; Wang, Tao; Zhu, Jun; Gao, Xiang; Gao, Yuxing; Zhao, Yufen |
Journal of publication | Inorganic chemistry |
Year of publication | 2015 |
Journal volume | 54 |
Journal issue | 9 |
Pages of publication | 4423 - 4430 |
a | 11.819 ± 0.0014 Å |
b | 19.8686 ± 0.0016 Å |
c | 17.0018 ± 0.0014 Å |
α | 90° |
β | 108.128 ± 0.01° |
γ | 90° |
Cell volume | 3794.3 ± 0.7 Å3 |
Cell temperature | 293 ± 2 K |
Ambient diffraction temperature | 293 ± 2 K |
Number of distinct elements | 6 |
Space group number | 14 |
Hermann-Mauguin space group symbol | P 1 21/n 1 |
Hall space group symbol | -P 2yn |
Residual factor for all reflections | 0.1109 |
Residual factor for significantly intense reflections | 0.0705 |
Weighted residual factors for significantly intense reflections | 0.1767 |
Weighted residual factors for all reflections included in the refinement | 0.2198 |
Goodness-of-fit parameter for all reflections included in the refinement | 0.979 |
Diffraction radiation wavelength | 0.71073 Å |
Diffraction radiation type | MoKα |