Information card for entry 4343205
Formula | C48 H59 Ge N2 O P S |
Calculated formula | C48 H59 Ge N2 O P S |
SMILES | [Ge]1(N(C(=CC(=[N]1c1c(C(C)C)cccc1C(C)C)C)C)c1c(cccc1C(C)C)C(C)C)OP(=S)(c1ccccc1)c1ccccc1.c1ccccc1C |
Title of publication | Reactivity of Germylene toward Phosphorus-Containing Compounds: Nucleophilic Addition and Tautomerism. |
Authors of publication | Wu, Yile; Liu, Liu; Su, Jue; Yan, Kaili; Wang, Tao; Zhu, Jun; Gao, Xiang; Gao, Yuxing; Zhao, Yufen |
Journal of publication | Inorganic chemistry |
Year of publication | 2015 |
Journal volume | 54 |
Journal issue | 9 |
Pages of publication | 4423 - 4430 |
a | 9.5906 ± 0.0014 Å |
b | 12.0751 ± 0.0017 Å |
c | 20.452 ± 0.003 Å |
α | 104.345 ± 0.002° |
β | 92.58 ± 0.003° |
γ | 108.515 ± 0.002° |
Cell volume | 2156.1 ± 0.5 Å3 |
Cell temperature | 273 ± 2 K |
Ambient diffraction temperature | 273 ± 2 K |
Number of distinct elements | 7 |
Space group number | 2 |
Hermann-Mauguin space group symbol | P -1 |
Hall space group symbol | -P 1 |
Residual factor for all reflections | 0.042 |
Residual factor for significantly intense reflections | 0.0382 |
Weighted residual factors for significantly intense reflections | 0.1122 |
Weighted residual factors for all reflections included in the refinement | 0.1144 |
Goodness-of-fit parameter for all reflections included in the refinement | 1.063 |
Diffraction radiation wavelength | 0.71073 Å |
Diffraction radiation type | MoKα |