Information card for entry 4343206
Formula | C33 H51 Ge N2 O3 P S |
Calculated formula | C33 H51 Ge N2 O3.09 P S |
Title of publication | Reactivity of Germylene toward Phosphorus-Containing Compounds: Nucleophilic Addition and Tautomerism. |
Authors of publication | Wu, Yile; Liu, Liu; Su, Jue; Yan, Kaili; Wang, Tao; Zhu, Jun; Gao, Xiang; Gao, Yuxing; Zhao, Yufen |
Journal of publication | Inorganic chemistry |
Year of publication | 2015 |
Journal volume | 54 |
Journal issue | 9 |
Pages of publication | 4423 - 4430 |
a | 8.5587 ± 0.0019 Å |
b | 11.772 ± 0.003 Å |
c | 17.278 ± 0.004 Å |
α | 79.562 ± 0.004° |
β | 88.408 ± 0.004° |
γ | 82.592 ± 0.004° |
Cell volume | 1697.7 ± 0.7 Å3 |
Cell temperature | 298 ± 2 K |
Ambient diffraction temperature | 298 ± 2 K |
Number of distinct elements | 7 |
Space group number | 2 |
Hermann-Mauguin space group symbol | P -1 |
Hall space group symbol | -P 1 |
Residual factor for all reflections | 0.072 |
Residual factor for significantly intense reflections | 0.0667 |
Weighted residual factors for significantly intense reflections | 0.168 |
Weighted residual factors for all reflections included in the refinement | 0.1719 |
Goodness-of-fit parameter for all reflections included in the refinement | 1.094 |
Diffraction radiation wavelength | 0.71073 Å |
Diffraction radiation type | MoKα |