Information card for entry 4343210
Formula | C46 H14 Cl16 Cu F12 N2 O4 |
Calculated formula | C46 H14 Cl16 Cu F12 N2 O4 |
Title of publication | Intramolecular Ferromagnetic Radical-Cu(II) Coupling in a Cu(II) Complex Ligated with Pyridyl-Substituted Triarylmethyl Radicals. |
Authors of publication | Kusamoto, Tetsuro; Hattori, Yohei; Tanushi, Akira; Nishihara, Hiroshi |
Journal of publication | Inorganic chemistry |
Year of publication | 2015 |
Journal volume | 54 |
Journal issue | 9 |
Pages of publication | 4186 - 4188 |
a | 9.107 ± 0.002 Å |
b | 14.594 ± 0.004 Å |
c | 20.758 ± 0.005 Å |
α | 96.054 ± 0.004° |
β | 94.587 ± 0.004° |
γ | 90.641 ± 0.004° |
Cell volume | 2734.2 ± 1.2 Å3 |
Cell temperature | 113 ± 2 K |
Ambient diffraction temperature | 113 ± 2 K |
Number of distinct elements | 7 |
Space group number | 2 |
Hermann-Mauguin space group symbol | P -1 |
Hall space group symbol | -P 1 |
Residual factor for all reflections | 0.0905 |
Residual factor for significantly intense reflections | 0.0794 |
Weighted residual factors for significantly intense reflections | 0.2052 |
Weighted residual factors for all reflections included in the refinement | 0.2095 |
Goodness-of-fit parameter for all reflections included in the refinement | 1.169 |
Diffraction radiation wavelength | 0.71073 Å |
Diffraction radiation type | MoKα |