Information card for entry 4343209
Formula | C46 H14 Cl16 F12 N2 O4 Zn |
Calculated formula | C46 H14 Cl16 F12 N2 O4 Zn |
Title of publication | Intramolecular Ferromagnetic Radical-Cu(II) Coupling in a Cu(II) Complex Ligated with Pyridyl-Substituted Triarylmethyl Radicals. |
Authors of publication | Kusamoto, Tetsuro; Hattori, Yohei; Tanushi, Akira; Nishihara, Hiroshi |
Journal of publication | Inorganic chemistry |
Year of publication | 2015 |
Journal volume | 54 |
Journal issue | 9 |
Pages of publication | 4186 - 4188 |
a | 9.092 ± 0.003 Å |
b | 14.604 ± 0.004 Å |
c | 21.017 ± 0.007 Å |
α | 97.123 ± 0.003° |
β | 94.549 ± 0.004° |
γ | 90.761 ± 0.004° |
Cell volume | 2759.6 ± 1.5 Å3 |
Cell temperature | 113 ± 2 K |
Ambient diffraction temperature | 113 ± 2 K |
Number of distinct elements | 7 |
Space group number | 2 |
Hermann-Mauguin space group symbol | P -1 |
Hall space group symbol | -P 1 |
Residual factor for all reflections | 0.0795 |
Residual factor for significantly intense reflections | 0.0586 |
Weighted residual factors for significantly intense reflections | 0.1371 |
Weighted residual factors for all reflections included in the refinement | 0.1558 |
Goodness-of-fit parameter for all reflections included in the refinement | 1.128 |
Diffraction radiation wavelength | 0.71073 Å |
Diffraction radiation type | MoKα |