Information card for entry 4343298
Formula | C65 H53 B F24 N3 Rh |
Calculated formula | C65 H53 B F24 N3 Rh |
SMILES | [Rh]12345(N(c6[n]1c(ccc6)c1c(cc(N(C)C)cc1C)C)c1c(cccc1C)C)[c]1([c]2([c]5([c]4([c]31C)C)C)C)C.FC(F)(F)c1cc(cc(c1)C(F)(F)F)[B-](c1cc(cc(c1)C(F)(F)F)C(F)(F)F)(c1cc(cc(c1)C(F)(F)F)C(F)(F)F)c1cc(cc(c1)C(F)(F)F)C(F)(F)F |
Title of publication | Synthesis and Reactivity toward H2 of (η(5)-C5Me5)Rh(III) Complexes with Bulky Aminopyridinate Ligands. |
Authors of publication | Zamorano, Ana; Rendón, Nuria; Valpuesta, José E V; Álvarez, Eleuterio; Carmona, Ernesto |
Journal of publication | Inorganic chemistry |
Year of publication | 2015 |
Journal volume | 54 |
Journal issue | 13 |
Pages of publication | 6573 - 6581 |
a | 12.2034 ± 0.0004 Å |
b | 13.7463 ± 0.0005 Å |
c | 20.1742 ± 0.0006 Å |
α | 92.312 ± 0.001° |
β | 105.548 ± 0.001° |
γ | 102.094 ± 0.001° |
Cell volume | 3171.28 ± 0.18 Å3 |
Cell temperature | 173 ± 2 K |
Ambient diffraction temperature | 173 ± 2 K |
Number of distinct elements | 6 |
Space group number | 2 |
Hermann-Mauguin space group symbol | P -1 |
Hall space group symbol | -P 1 |
Residual factor for all reflections | 0.046 |
Residual factor for significantly intense reflections | 0.0381 |
Weighted residual factors for significantly intense reflections | 0.1009 |
Weighted residual factors for all reflections included in the refinement | 0.1044 |
Goodness-of-fit parameter for all reflections included in the refinement | 1.078 |
Diffraction radiation wavelength | 0.71073 Å |
Diffraction radiation type | MoKα |