Information card for entry 4343314
Formula | C22 H26.67 N4 O2.33 P2 Se2 |
Calculated formula | C22 H26 N4 O2.33 P2 Se2 |
Title of publication | Synthesis and Hydrolytic Studies on the Air-Stable [(4-CN-PhO)(E)P(μ-N(t)Bu)]2 (E = O, S, and Se) Cyclodiphosphazanes. |
Authors of publication | Shi, Yan X.; Liang, Rong Z.; Martin, Katherine A.; Weston, Nicholas; Gonzalez-Calera, Silvia; Ganguly, Rakesh; Li, Yongxin; Lu, Yunpeng; Ribeiro, António J M; Ramos, Maria J.; Fernandes, Pedro A.; García, Felipe |
Journal of publication | Inorganic chemistry |
Year of publication | 2015 |
Journal volume | 54 |
Journal issue | 13 |
Pages of publication | 6423 - 6432 |
a | 28.954 ± 0.001 Å |
b | 28.954 ± 0.001 Å |
c | 8.8123 ± 0.0004 Å |
α | 90° |
β | 90° |
γ | 120° |
Cell volume | 6397.9 ± 0.4 Å3 |
Cell temperature | 180 ± 2 K |
Ambient diffraction temperature | 180 ± 2 K |
Number of distinct elements | 6 |
Space group number | 148 |
Hermann-Mauguin space group symbol | R -3 :H |
Hall space group symbol | -R 3 |
Residual factor for all reflections | 0.0925 |
Residual factor for significantly intense reflections | 0.0681 |
Weighted residual factors for significantly intense reflections | 0.1967 |
Weighted residual factors for all reflections included in the refinement | 0.2086 |
Goodness-of-fit parameter for all reflections included in the refinement | 1.098 |
Diffraction radiation wavelength | 0.71073 Å |
Diffraction radiation type | MoKα |