Information card for entry 4343315
Formula | C8 H18 Cl2 N2 P2 S2 |
Calculated formula | C8 H18 Cl2 N2 P2 S2 |
Title of publication | Synthesis and Hydrolytic Studies on the Air-Stable [(4-CN-PhO)(E)P(μ-N(t)Bu)]2 (E = O, S, and Se) Cyclodiphosphazanes. |
Authors of publication | Shi, Yan X.; Liang, Rong Z.; Martin, Katherine A.; Weston, Nicholas; Gonzalez-Calera, Silvia; Ganguly, Rakesh; Li, Yongxin; Lu, Yunpeng; Ribeiro, António J M; Ramos, Maria J.; Fernandes, Pedro A.; García, Felipe |
Journal of publication | Inorganic chemistry |
Year of publication | 2015 |
Journal volume | 54 |
Journal issue | 13 |
Pages of publication | 6423 - 6432 |
a | 8.3283 ± 0.0006 Å |
b | 8.4922 ± 0.0007 Å |
c | 11.9547 ± 0.001 Å |
α | 105.125 ± 0.002° |
β | 97.897 ± 0.002° |
γ | 102.816 ± 0.002° |
Cell volume | 778.57 ± 0.11 Å3 |
Cell temperature | 103 ± 2 K |
Ambient diffraction temperature | 103 ± 2 K |
Number of distinct elements | 6 |
Space group number | 2 |
Hermann-Mauguin space group symbol | P -1 |
Hall space group symbol | -P 1 |
Residual factor for all reflections | 0.0476 |
Residual factor for significantly intense reflections | 0.0334 |
Weighted residual factors for significantly intense reflections | 0.0786 |
Weighted residual factors for all reflections included in the refinement | 0.0868 |
Goodness-of-fit parameter for all reflections included in the refinement | 1.034 |
Diffraction radiation wavelength | 0.71073 Å |