Information card for entry 4343316
Formula | C22 H26 N4 O2 P2 |
Calculated formula | C22 H26 N4 O2 P2 |
SMILES | C(C)(C)(C)N1P2(N(C(C)(C)C)P12Oc1ccc(C#N)cc1)Oc1ccc(C#N)cc1 |
Title of publication | Synthesis and Hydrolytic Studies on the Air-Stable [(4-CN-PhO)(E)P(μ-N(t)Bu)]2 (E = O, S, and Se) Cyclodiphosphazanes. |
Authors of publication | Shi, Yan X.; Liang, Rong Z.; Martin, Katherine A.; Weston, Nicholas; Gonzalez-Calera, Silvia; Ganguly, Rakesh; Li, Yongxin; Lu, Yunpeng; Ribeiro, António J M; Ramos, Maria J.; Fernandes, Pedro A.; García, Felipe |
Journal of publication | Inorganic chemistry |
Year of publication | 2015 |
Journal volume | 54 |
Journal issue | 13 |
Pages of publication | 6423 - 6432 |
a | 10.1792 ± 0.0004 Å |
b | 11.1382 ± 0.0005 Å |
c | 20.0312 ± 0.001 Å |
α | 90° |
β | 90° |
γ | 90° |
Cell volume | 2271.1 ± 0.18 Å3 |
Cell temperature | 103 ± 2 K |
Ambient diffraction temperature | 103 ± 2 K |
Number of distinct elements | 5 |
Space group number | 19 |
Hermann-Mauguin space group symbol | P 21 21 21 |
Hall space group symbol | P 2ac 2ab |
Residual factor for all reflections | 0.0346 |
Residual factor for significantly intense reflections | 0.0304 |
Weighted residual factors for significantly intense reflections | 0.0714 |
Weighted residual factors for all reflections included in the refinement | 0.0773 |
Goodness-of-fit parameter for all reflections included in the refinement | 1.049 |
Diffraction radiation wavelength | 0.71073 Å |
Diffraction radiation type | MoKα |