Information card for entry 4343345
Formula | C13 H12 B N8 O4 Zn |
Calculated formula | C13 H12 B N8 O4 Zn |
Title of publication | A Rational Strategy To Construct a Neutral Boron Imidazolate Framework with Encapsulated Small-Size Au-Pd Nanoparticles for Catalysis. |
Authors of publication | Zhang, De-Xiang; Liu, Juan; Zhang, Hai-Xia; Wen, Tian; Zhang, Jian |
Journal of publication | Inorganic chemistry |
Year of publication | 2015 |
Journal volume | 54 |
Journal issue | 13 |
Pages of publication | 6069 - 6071 |
a | 8.8649 ± 0.0004 Å |
b | 10.5565 ± 0.0004 Å |
c | 10.631 ± 0.0005 Å |
α | 99.986 ± 0.003° |
β | 110.233 ± 0.004° |
γ | 97.819 ± 0.004° |
Cell volume | 898.42 ± 0.08 Å3 |
Cell temperature | 293 ± 2 K |
Ambient diffraction temperature | 293 ± 2 K |
Number of distinct elements | 6 |
Space group number | 2 |
Hermann-Mauguin space group symbol | P -1 |
Hall space group symbol | -P 1 |
Residual factor for all reflections | 0.0665 |
Residual factor for significantly intense reflections | 0.0655 |
Weighted residual factors for significantly intense reflections | 0.1802 |
Weighted residual factors for all reflections included in the refinement | 0.1813 |
Goodness-of-fit parameter for all reflections included in the refinement | 0.818 |
Diffraction radiation wavelength | 1.54178 Å |
Diffraction radiation type | CuKα |