Information card for entry 4343346
Formula | C13 H12 B Cu N8 O5 |
Calculated formula | C13 H12 B Cu N8 O5 |
Title of publication | A Rational Strategy To Construct a Neutral Boron Imidazolate Framework with Encapsulated Small-Size Au-Pd Nanoparticles for Catalysis. |
Authors of publication | Zhang, De-Xiang; Liu, Juan; Zhang, Hai-Xia; Wen, Tian; Zhang, Jian |
Journal of publication | Inorganic chemistry |
Year of publication | 2015 |
Journal volume | 54 |
Journal issue | 13 |
Pages of publication | 6069 - 6071 |
a | 8.7768 ± 0.001 Å |
b | 10.3933 ± 0.0009 Å |
c | 11.0723 ± 0.0012 Å |
α | 100.215 ± 0.008° |
β | 109.697 ± 0.01° |
γ | 98.323 ± 0.008° |
Cell volume | 912.76 ± 0.18 Å3 |
Cell temperature | 293 ± 2 K |
Ambient diffraction temperature | 293 ± 2 K |
Number of distinct elements | 6 |
Space group number | 2 |
Hermann-Mauguin space group symbol | P -1 |
Hall space group symbol | -P 1 |
Residual factor for all reflections | 0.0712 |
Residual factor for significantly intense reflections | 0.0472 |
Weighted residual factors for significantly intense reflections | 0.1206 |
Weighted residual factors for all reflections included in the refinement | 0.1376 |
Goodness-of-fit parameter for all reflections included in the refinement | 0.837 |
Diffraction radiation wavelength | 0.71073 Å |
Diffraction radiation type | MoKα |