Information card for entry 4343348
Formula | C13 H12 B Mn N8 O5 |
Calculated formula | C13 H12 B Mn N8 O5 |
Title of publication | A Rational Strategy To Construct a Neutral Boron Imidazolate Framework with Encapsulated Small-Size Au-Pd Nanoparticles for Catalysis. |
Authors of publication | Zhang, De-Xiang; Liu, Juan; Zhang, Hai-Xia; Wen, Tian; Zhang, Jian |
Journal of publication | Inorganic chemistry |
Year of publication | 2015 |
Journal volume | 54 |
Journal issue | 13 |
Pages of publication | 6069 - 6071 |
a | 8.997 ± 0.0005 Å |
b | 10.5163 ± 0.0005 Å |
c | 10.686 ± 0.0007 Å |
α | 98.008 ± 0.005° |
β | 97.436 ± 0.005° |
γ | 111.11 ± 0.005° |
Cell volume | 916.19 ± 0.1 Å3 |
Cell temperature | 293 ± 2 K |
Ambient diffraction temperature | 293 ± 2 K |
Number of distinct elements | 6 |
Space group number | 2 |
Hermann-Mauguin space group symbol | P -1 |
Hall space group symbol | -P 1 |
Residual factor for all reflections | 0.0412 |
Residual factor for significantly intense reflections | 0.0389 |
Weighted residual factors for significantly intense reflections | 0.1099 |
Weighted residual factors for all reflections included in the refinement | 0.1126 |
Goodness-of-fit parameter for all reflections included in the refinement | 1.075 |
Diffraction radiation wavelength | 1.54178 Å |
Diffraction radiation type | CuKα |