Information card for entry 4343347
Formula | C13 H12 B Cd N8 O5 |
Calculated formula | C13 H12 B Cd N8 O5 |
Title of publication | A Rational Strategy To Construct a Neutral Boron Imidazolate Framework with Encapsulated Small-Size Au-Pd Nanoparticles for Catalysis. |
Authors of publication | Zhang, De-Xiang; Liu, Juan; Zhang, Hai-Xia; Wen, Tian; Zhang, Jian |
Journal of publication | Inorganic chemistry |
Year of publication | 2015 |
Journal volume | 54 |
Journal issue | 13 |
Pages of publication | 6069 - 6071 |
a | 9.0162 ± 0.0007 Å |
b | 10.7479 ± 0.0007 Å |
c | 10.8068 ± 0.0004 Å |
α | 97.57 ± 0.004° |
β | 97.708 ± 0.005° |
γ | 110.1 ± 0.006° |
Cell volume | 956.61 ± 0.11 Å3 |
Cell temperature | 293 ± 2 K |
Ambient diffraction temperature | 293 ± 2 K |
Number of distinct elements | 6 |
Space group number | 2 |
Hermann-Mauguin space group symbol | P -1 |
Hall space group symbol | -P 1 |
Residual factor for all reflections | 0.0416 |
Residual factor for significantly intense reflections | 0.0329 |
Weighted residual factors for significantly intense reflections | 0.0948 |
Weighted residual factors for all reflections included in the refinement | 0.107 |
Goodness-of-fit parameter for all reflections included in the refinement | 0.559 |
Diffraction radiation wavelength | 0.71073 Å |
Diffraction radiation type | MoKα |