Information card for entry 4343366
Formula | C44 H50 F6 Ir N6 P |
Calculated formula | C44 H50 F6 Ir N6 P |
Title of publication | Dual-Emissive Cyclometalated Iridium(III) Polypyridine Complexes as Ratiometric Biological Probes and Organelle-Selective Bioimaging Reagents. |
Authors of publication | Zhang, Kenneth Yin; Liu, Hua-Wei; Tang, Man-Chung; Choi, Alex Wing-Tat; Zhu, Nianyong; Wei, Xi-Guang; Lau, Kai-Chung; Lo, Kenneth Kam-Wing |
Journal of publication | Inorganic chemistry |
Year of publication | 2015 |
Journal volume | 54 |
Journal issue | 13 |
Pages of publication | 6582 - 6593 |
a | 15.378 ± 0.003 Å |
b | 23.778 ± 0.005 Å |
c | 12.132 ± 0.002 Å |
α | 90° |
β | 97.89 ± 0.03° |
γ | 90 ± 0.03° |
Cell volume | 4394.2 ± 1.5 Å3 |
Cell temperature | 301 ± 2 K |
Ambient diffraction temperature | 301 ± 2 K |
Number of distinct elements | 6 |
Space group number | 15 |
Hermann-Mauguin space group symbol | C 1 2/c 1 |
Hall space group symbol | -C 2yc |
Residual factor for all reflections | 0.0456 |
Residual factor for significantly intense reflections | 0.0357 |
Weighted residual factors for significantly intense reflections | 0.0965 |
Weighted residual factors for all reflections included in the refinement | 0.1019 |
Goodness-of-fit parameter for all reflections included in the refinement | 0.9 |
Diffraction radiation wavelength | 0.71073 Å |
Diffraction radiation type | MoKα |