Information card for entry 4343367
Formula | C107 H148 Al2 Cu8 N4 O4 |
Calculated formula | C107 H148 Al2 Cu8 N4 O4 |
Title of publication | Synthesis and Characterization of Heterobimetallic Al-O-Cu Complexes toward Models for Heterogeneous Catalysts on Metal Oxide Surfaces. |
Authors of publication | Li, Bin; Zhang, Chunyan; Yang, Ying; Zhu, Hongping; Roesky, Herbert W. |
Journal of publication | Inorganic chemistry |
Year of publication | 2015 |
Journal volume | 54 |
Journal issue | 13 |
Pages of publication | 6641 - 6646 |
a | 16.4996 ± 0.0005 Å |
b | 16.7704 ± 0.0006 Å |
c | 22.6852 ± 0.0008 Å |
α | 87.514 ± 0.003° |
β | 85.466 ± 0.003° |
γ | 63.309 ± 0.003° |
Cell volume | 5590.5 ± 0.4 Å3 |
Cell temperature | 173 ± 2 K |
Ambient diffraction temperature | 173 ± 2 K |
Number of distinct elements | 6 |
Space group number | 2 |
Hermann-Mauguin space group symbol | P -1 |
Hall space group symbol | -P 1 |
Residual factor for all reflections | 0.0604 |
Residual factor for significantly intense reflections | 0.0471 |
Weighted residual factors for significantly intense reflections | 0.1232 |
Weighted residual factors for all reflections included in the refinement | 0.1327 |
Goodness-of-fit parameter for all reflections included in the refinement | 1.067 |
Diffraction radiation wavelength | 1.54178 Å |
Diffraction radiation type | CuKα |