Information card for entry 4343368
Formula | C39 H55 Al Cu2 N2 O |
Calculated formula | C39 H55 Al Cu2 N2 O |
Title of publication | Synthesis and Characterization of Heterobimetallic Al-O-Cu Complexes toward Models for Heterogeneous Catalysts on Metal Oxide Surfaces. |
Authors of publication | Li, Bin; Zhang, Chunyan; Yang, Ying; Zhu, Hongping; Roesky, Herbert W. |
Journal of publication | Inorganic chemistry |
Year of publication | 2015 |
Journal volume | 54 |
Journal issue | 13 |
Pages of publication | 6641 - 6646 |
a | 12.3209 ± 0.0011 Å |
b | 15.3926 ± 0.0009 Å |
c | 20.5844 ± 0.0013 Å |
α | 90° |
β | 104.797 ± 0.007° |
γ | 90° |
Cell volume | 3774.4 ± 0.5 Å3 |
Cell temperature | 173 ± 2 K |
Ambient diffraction temperature | 173 ± 2 K |
Number of distinct elements | 6 |
Space group number | 14 |
Hermann-Mauguin space group symbol | P 1 21/n 1 |
Hall space group symbol | -P 2yn |
Residual factor for all reflections | 0.0972 |
Residual factor for significantly intense reflections | 0.0637 |
Weighted residual factors for significantly intense reflections | 0.1259 |
Weighted residual factors for all reflections included in the refinement | 0.1389 |
Goodness-of-fit parameter for all reflections included in the refinement | 1.05 |
Diffraction radiation wavelength | 0.71073 Å |
Diffraction radiation type | MoKα |