Information card for entry 4343373
Formula | C70 H71.5 Gd2 N7 Na2 O17.25 |
Calculated formula | C70 H71.5 Gd2 N7 Na2 O17.25 |
Title of publication | Slow Magnetic Relaxation Observed in Dysprosium Compounds Containing Unsupported Near-Linear Hydroxo- and Fluoro-Bridges. |
Authors of publication | Brunet, Gabriel; Habib, Fatemah; Korobkov, Ilia; Murugesu, Muralee |
Journal of publication | Inorganic chemistry |
Year of publication | 2015 |
Journal volume | 54 |
Journal issue | 13 |
Pages of publication | 6195 - 6202 |
a | 18.2216 ± 0.001 Å |
b | 17.7292 ± 0.0009 Å |
c | 22.546 ± 0.0013 Å |
α | 90° |
β | 93.694 ± 0.002° |
γ | 90° |
Cell volume | 7268.5 ± 0.7 Å3 |
Cell temperature | 200 ± 2 K |
Ambient diffraction temperature | 200 ± 2 K |
Number of distinct elements | 6 |
Space group number | 14 |
Hermann-Mauguin space group symbol | P 1 21/n 1 |
Hall space group symbol | -P 2yn |
Residual factor for all reflections | 0.052 |
Residual factor for significantly intense reflections | 0.0363 |
Weighted residual factors for significantly intense reflections | 0.0923 |
Weighted residual factors for all reflections included in the refinement | 0.0982 |
Goodness-of-fit parameter for all reflections included in the refinement | 1.068 |
Diffraction radiation wavelength | 0.71073 Å |
Diffraction radiation type | MoKα |