Information card for entry 4343374
Formula | C71 H75 Dy2 N7 Na2 O18 |
Calculated formula | C71 H75 Dy2 N7 Na2 O18 |
Title of publication | Slow Magnetic Relaxation Observed in Dysprosium Compounds Containing Unsupported Near-Linear Hydroxo- and Fluoro-Bridges. |
Authors of publication | Brunet, Gabriel; Habib, Fatemah; Korobkov, Ilia; Murugesu, Muralee |
Journal of publication | Inorganic chemistry |
Year of publication | 2015 |
Journal volume | 54 |
Journal issue | 13 |
Pages of publication | 6195 - 6202 |
a | 18.1254 ± 0.0004 Å |
b | 17.7273 ± 0.0004 Å |
c | 22.4308 ± 0.0005 Å |
α | 90° |
β | 94.072 ± 0.001° |
γ | 90° |
Cell volume | 7189.1 ± 0.3 Å3 |
Cell temperature | 200 ± 2 K |
Ambient diffraction temperature | 200 ± 2 K |
Number of distinct elements | 6 |
Space group number | 14 |
Hermann-Mauguin space group symbol | P 1 21/n 1 |
Hall space group symbol | -P 2yn |
Residual factor for all reflections | 0.0452 |
Residual factor for significantly intense reflections | 0.0336 |
Weighted residual factors for significantly intense reflections | 0.0839 |
Weighted residual factors for all reflections included in the refinement | 0.091 |
Goodness-of-fit parameter for all reflections included in the refinement | 1.055 |
Diffraction radiation wavelength | 0.71073 Å |
Diffraction radiation type | MoKα |