Information card for entry 4343375
Formula | C42.5 H58 Cl2 Dy2 F3 N6 Na3 O11.5 |
Calculated formula | C42.5 H58 Cl2 Dy2 F3 N6 Na3 O11.5 |
SMILES | [Dy]1234(F)(Oc5c(OC)cccc5C=[N]2CC[NH]3CC[N]4=Cc2c(O1)c(OC)ccc2)[F][Dy]1234(F)Oc5c(OC)cccc5C=[N]2CC[NH]3CC[N]4=Cc2c(O1)c(OC)ccc2.[Na+].[Na+].[Na+].[Cl-].[Cl-].OC.OC.OC.O |
Title of publication | Slow Magnetic Relaxation Observed in Dysprosium Compounds Containing Unsupported Near-Linear Hydroxo- and Fluoro-Bridges. |
Authors of publication | Brunet, Gabriel; Habib, Fatemah; Korobkov, Ilia; Murugesu, Muralee |
Journal of publication | Inorganic chemistry |
Year of publication | 2015 |
Journal volume | 54 |
Journal issue | 13 |
Pages of publication | 6195 - 6202 |
a | 14.4396 ± 0.0005 Å |
b | 15.3862 ± 0.0005 Å |
c | 15.9818 ± 0.0005 Å |
α | 113.089 ± 0.002° |
β | 98.589 ± 0.002° |
γ | 103.782 ± 0.002° |
Cell volume | 3052.86 ± 0.19 Å3 |
Cell temperature | 200 ± 2 K |
Ambient diffraction temperature | 200 ± 2 K |
Number of distinct elements | 8 |
Space group number | 2 |
Hermann-Mauguin space group symbol | P -1 |
Hall space group symbol | -P 1 |
Residual factor for all reflections | 0.0895 |
Residual factor for significantly intense reflections | 0.0601 |
Weighted residual factors for significantly intense reflections | 0.1462 |
Weighted residual factors for all reflections included in the refinement | 0.1661 |
Goodness-of-fit parameter for all reflections included in the refinement | 1.053 |
Diffraction radiation wavelength | 0.71073 Å |
Diffraction radiation type | MoKα |