Information card for entry 4343397
Formula | C21 H32 Fe N2 O |
Calculated formula | C21 H32 Fe N2 O |
SMILES | C(=O)N([c]12[cH]3[cH]4[cH]5[cH]1[Fe]16782345[c]2([cH]1[cH]6[cH]7[cH]82)NCC(C)(C)C)CC(C)(C)C |
Title of publication | A Stable Planar-Chiral N-Heterocyclic Carbene with a 1,1'-Ferrocenediyl Backbone. |
Authors of publication | Petrov, Alex R.; Derheim, Anatoli; Oetzel, Jan; Leibold, Michael; Bruhn, Clemens; Scheerer, Stefan; Oßwald, Steffen; Winter, Rainer F.; Siemeling, Ulrich |
Journal of publication | Inorganic chemistry |
Year of publication | 2015 |
Journal volume | 54 |
Journal issue | 13 |
Pages of publication | 6657 - 6670 |
a | 9.9201 ± 0.0011 Å |
b | 10.7066 ± 0.0011 Å |
c | 11.0762 ± 0.0013 Å |
α | 85.767 ± 0.009° |
β | 72.107 ± 0.008° |
γ | 64.675 ± 0.008° |
Cell volume | 1009.6 ± 0.2 Å3 |
Cell temperature | 100 ± 2 K |
Ambient diffraction temperature | 100 ± 2 K |
Number of distinct elements | 5 |
Space group number | 2 |
Hermann-Mauguin space group symbol | P -1 |
Hall space group symbol | -P 1 |
Residual factor for all reflections | 0.0862 |
Residual factor for significantly intense reflections | 0.0741 |
Weighted residual factors for significantly intense reflections | 0.1987 |
Weighted residual factors for all reflections included in the refinement | 0.2122 |
Goodness-of-fit parameter for all reflections included in the refinement | 1.054 |
Diffraction radiation wavelength | 0.71073 Å |
Diffraction radiation type | MoKα |