Information card for entry 4343398
Formula | C88 H71 Dy7 N3 O39.5 |
Calculated formula | C88 H60 Dy7 N3 O39.5 |
Title of publication | Magnetic Properties of 3D Heptanuclear Lanthanide Frameworks Supported by Mixed Ligands. |
Authors of publication | Hu, Fa-Lu; Jiang, Fei-Long; Zheng, Jun; Wu, Ming-Yan; Pang, Jian-Dong; Hong, Mao-Chun |
Journal of publication | Inorganic chemistry |
Year of publication | 2015 |
Journal volume | 54 |
Journal issue | 13 |
Pages of publication | 6081 - 6083 |
a | 14.0564 ± 0.0005 Å |
b | 17.1977 ± 0.0007 Å |
c | 22.218 ± 0.0009 Å |
α | 99.592 ± 0.014° |
β | 105.655 ± 0.01° |
γ | 112.612 ± 0.01° |
Cell volume | 4547.9 ± 0.8 Å3 |
Cell temperature | 293 ± 2 K |
Ambient diffraction temperature | 293 ± 2 K |
Number of distinct elements | 5 |
Space group number | 2 |
Hermann-Mauguin space group symbol | P -1 |
Hall space group symbol | -P 1 |
Residual factor for all reflections | 0.0495 |
Residual factor for significantly intense reflections | 0.0425 |
Weighted residual factors for significantly intense reflections | 0.1112 |
Weighted residual factors for all reflections included in the refinement | 0.1189 |
Goodness-of-fit parameter for all reflections included in the refinement | 1.034 |
Diffraction radiation wavelength | 0.71073 Å |
Diffraction radiation type | MoKα |