Information card for entry 4343399
Formula | C88 H71 Gd7 N3 O39.5 |
Calculated formula | C88 H52 Gd7 N3 O39.5 |
Title of publication | Magnetic Properties of 3D Heptanuclear Lanthanide Frameworks Supported by Mixed Ligands. |
Authors of publication | Hu, Fa-Lu; Jiang, Fei-Long; Zheng, Jun; Wu, Ming-Yan; Pang, Jian-Dong; Hong, Mao-Chun |
Journal of publication | Inorganic chemistry |
Year of publication | 2015 |
Journal volume | 54 |
Journal issue | 13 |
Pages of publication | 6081 - 6083 |
a | 13.9029 ± 0.0003 Å |
b | 16.9641 ± 0.0003 Å |
c | 22.0259 ± 0.0005 Å |
α | 99.309 ± 0.002° |
β | 106.023 ± 0.002° |
γ | 112.189 ± 0.002° |
Cell volume | 4411.9 ± 0.2 Å3 |
Cell temperature | 293 ± 2 K |
Ambient diffraction temperature | 293 ± 2 K |
Number of distinct elements | 5 |
Space group number | 2 |
Hermann-Mauguin space group symbol | P -1 |
Hall space group symbol | -P 1 |
Residual factor for all reflections | 0.0534 |
Residual factor for significantly intense reflections | 0.0455 |
Weighted residual factors for significantly intense reflections | 0.102 |
Weighted residual factors for all reflections included in the refinement | 0.1084 |
Goodness-of-fit parameter for all reflections included in the refinement | 1.057 |
Diffraction radiation wavelength | 1.54184 Å |
Diffraction radiation type | CuKα |