Information card for entry 4343449
Formula | C36 H30 N2 O P2 S2 |
Calculated formula | C36 H30 N2 O P2 S2 |
Title of publication | Does Perthionitrite (SSNO(-)) Account for Sustained Bioactivity of NO? A (Bio)chemical Characterization. |
Authors of publication | Wedmann, Rudolf; Zahl, Achim; Shubina, Tatyana E.; Dürr, Maximilian; Heinemann, Frank W.; Bugenhagen, Bernhard Eberhard Christian; Burger, Peter; Ivanovic-Burmazovic, Ivana; Filipovic, Milos R. |
Journal of publication | Inorganic chemistry |
Year of publication | 2015 |
Journal volume | 54 |
Journal issue | 19 |
Pages of publication | 9367 - 9380 |
a | 11.84799 ± 0.00014 Å |
b | 16.68438 ± 0.00018 Å |
c | 15.50866 ± 0.00017 Å |
α | 90° |
β | 90° |
γ | 90° |
Cell volume | 3065.7 ± 0.06 Å3 |
Cell temperature | 100 ± 0.1 K |
Ambient diffraction temperature | 100 ± 0.1 K |
Number of distinct elements | 6 |
Space group number | 60 |
Hermann-Mauguin space group symbol | P b c n |
Hall space group symbol | -P 2n 2ab |
Residual factor for all reflections | 0.0393 |
Residual factor for significantly intense reflections | 0.0363 |
Weighted residual factors for significantly intense reflections | 0.0943 |
Weighted residual factors for all reflections included in the refinement | 0.0966 |
Goodness-of-fit parameter for all reflections included in the refinement | 1.043 |
Diffraction radiation probe | x-ray |
Diffraction radiation wavelength | 1.54184 Å |
Diffraction radiation type | CuKα |