Information card for entry 4343450
Formula | Co Ge H3 K O10 P2 |
Calculated formula | Co Ge H3 K O10 P2 |
Title of publication | Dimensional Reduction From 2D Layer to 1D Band for Germanophosphates Induced by the "Tailor Effect" of Fluoride. |
Authors of publication | Huang, Chun-Zuo; Liu, Biao; Wen, Lei; Zhuang, Rong-Chuan; Zhao, Jing-Tai; Pan, Yuanming; Mi, Jin-Xiao; Huang, Ya-Xi |
Journal of publication | Inorganic chemistry |
Year of publication | 2015 |
Journal volume | 54 |
Journal issue | 14 |
Pages of publication | 6978 - 6985 |
a | 4.454 ± 0.001 Å |
b | 6.1119 ± 0.0014 Å |
c | 7.8383 ± 0.0018 Å |
α | 102.02 ± 0.003° |
β | 97.21 ± 0.003° |
γ | 91.75 ± 0.003° |
Cell volume | 206.7 ± 0.08 Å3 |
Cell temperature | 173 ± 2 K |
Ambient diffraction temperature | 173 ± 2 K |
Number of distinct elements | 6 |
Space group number | 2 |
Hermann-Mauguin space group symbol | P -1 |
Hall space group symbol | -P 1 |
Residual factor for all reflections | 0.0255 |
Residual factor for significantly intense reflections | 0.0251 |
Weighted residual factors for significantly intense reflections | 0.064 |
Weighted residual factors for all reflections included in the refinement | 0.0643 |
Goodness-of-fit parameter for all reflections included in the refinement | 1.076 |
Diffraction radiation wavelength | 0.71073 Å |
Diffraction radiation type | MoKα |