Information card for entry 4343451
Formula | F2 Fe Ge2 H8 K4 O20 P4 |
Calculated formula | F2 Fe Ge2 H8 K4 O20 P4 |
Title of publication | Dimensional Reduction From 2D Layer to 1D Band for Germanophosphates Induced by the "Tailor Effect" of Fluoride. |
Authors of publication | Huang, Chun-Zuo; Liu, Biao; Wen, Lei; Zhuang, Rong-Chuan; Zhao, Jing-Tai; Pan, Yuanming; Mi, Jin-Xiao; Huang, Ya-Xi |
Journal of publication | Inorganic chemistry |
Year of publication | 2015 |
Journal volume | 54 |
Journal issue | 14 |
Pages of publication | 6978 - 6985 |
a | 9.968 ± 0.004 Å |
b | 16.193 ± 0.006 Å |
c | 12.75 ± 0.004 Å |
α | 90° |
β | 116.49 ± 0.02° |
γ | 90° |
Cell volume | 1841.9 ± 1.2 Å3 |
Cell temperature | 173 ± 2 K |
Ambient diffraction temperature | 173 ± 2 K |
Number of distinct elements | 7 |
Space group number | 14 |
Hermann-Mauguin space group symbol | P 1 21/c 1 |
Hall space group symbol | -P 2ybc |
Residual factor for all reflections | 0.0745 |
Residual factor for significantly intense reflections | 0.051 |
Weighted residual factors for significantly intense reflections | 0.0995 |
Weighted residual factors for all reflections included in the refinement | 0.1059 |
Goodness-of-fit parameter for all reflections included in the refinement | 1.028 |
Diffraction radiation wavelength | 0.71073 Å |
Diffraction radiation type | MoKα |