Information card for entry 4343457
Formula | C58 H41 Ag6 F18 Fe3 N13 O2 |
Calculated formula | C58 H41 Ag6 F18 Fe3 N13 O2 |
Title of publication | 1,1'-Bis(pyrazol-3-yl)ferrocene: A Clip Ligand That Forms Supramolecular Aggregates and Prismatic Hexanuclear Coinage Metal Complexes. |
Authors of publication | Veronelli, Mattia; Dechert, Sebastian; Demeshko, Serhiy; Meyer, Franc |
Journal of publication | Inorganic chemistry |
Year of publication | 2015 |
Journal volume | 54 |
Journal issue | 14 |
Pages of publication | 6917 - 6927 |
a | 14.885 ± 0.001 Å |
b | 15.5254 ± 0.0011 Å |
c | 16.6611 ± 0.0012 Å |
α | 82.301 ± 0.006° |
β | 67.97 ± 0.005° |
γ | 62.238 ± 0.005° |
Cell volume | 3154.4 ± 0.4 Å3 |
Cell temperature | 133 ± 2 K |
Ambient diffraction temperature | 133 ± 2 K |
Number of distinct elements | 7 |
Space group number | 2 |
Hermann-Mauguin space group symbol | P -1 |
Hall space group symbol | -P 1 |
Residual factor for all reflections | 0.059 |
Residual factor for significantly intense reflections | 0.0328 |
Weighted residual factors for significantly intense reflections | 0.0562 |
Weighted residual factors for all reflections included in the refinement | 0.0613 |
Goodness-of-fit parameter for all reflections included in the refinement | 0.928 |
Diffraction radiation wavelength | 0.71073 Å |
Diffraction radiation type | MoKα |