Information card for entry 4343458
Formula | C86.25 H45.5 Ag2 Al2 Cl1.5 F72 Mo2 N6 O12 P2 |
Calculated formula | C86.25 H45.5 Ag2 Al2 Cl1.5 F72 Mo2 N6 O12 P2 |
Title of publication | Novel Two- and Three-Dimensional Organometallic-Organic Hybrid Materials Based on Polyphosphorus Complexes. |
Authors of publication | Attenberger, Bianca; Peresypkina, Eugenia V.; Scheer, Manfred |
Journal of publication | Inorganic chemistry |
Year of publication | 2015 |
Journal volume | 54 |
Journal issue | 14 |
Pages of publication | 7021 - 7029 |
a | 18.5386 ± 0.0008 Å |
b | 30.4147 ± 0.0011 Å |
c | 20.9523 ± 0.0006 Å |
α | 90° |
β | 90.984 ± 0.003° |
γ | 90° |
Cell volume | 11812.1 ± 0.7 Å3 |
Cell temperature | 123 ± 2 K |
Ambient diffraction temperature | 123 ± 2 K |
Number of distinct elements | 10 |
Space group number | 14 |
Hermann-Mauguin space group symbol | P 1 21/c 1 |
Hall space group symbol | -P 2ybc |
Residual factor for all reflections | 0.108 |
Residual factor for significantly intense reflections | 0.0688 |
Weighted residual factors for significantly intense reflections | 0.18 |
Weighted residual factors for all reflections included in the refinement | 0.1966 |
Goodness-of-fit parameter for all reflections included in the refinement | 0.943 |
Diffraction radiation wavelength | 1.54178 Å |
Diffraction radiation type | CuKα |