Information card for entry 4343459
Formula | C42.3 H20.6 Ag Al Cl0.6 F36 Mo2 N2 O8 P2 |
Calculated formula | C42.3 H20.6 Ag Al Cl0.6 F36 Mo2 N2 O8 P2 |
Title of publication | Novel Two- and Three-Dimensional Organometallic-Organic Hybrid Materials Based on Polyphosphorus Complexes. |
Authors of publication | Attenberger, Bianca; Peresypkina, Eugenia V.; Scheer, Manfred |
Journal of publication | Inorganic chemistry |
Year of publication | 2015 |
Journal volume | 54 |
Journal issue | 14 |
Pages of publication | 7021 - 7029 |
a | 18.7262 ± 0.0008 Å |
b | 34.1911 ± 0.0011 Å |
c | 19.0465 ± 0.0006 Å |
α | 90° |
β | 107.821 ± 0.004° |
γ | 90° |
Cell volume | 11609.7 ± 0.8 Å3 |
Cell temperature | 123 ± 0.2 K |
Ambient diffraction temperature | 123 ± 2 K |
Number of distinct elements | 10 |
Space group number | 14 |
Hermann-Mauguin space group symbol | P 1 21/n 1 |
Hall space group symbol | -P 2yn |
Residual factor for all reflections | 0.087 |
Residual factor for significantly intense reflections | 0.0645 |
Weighted residual factors for significantly intense reflections | 0.1722 |
Weighted residual factors for all reflections included in the refinement | 0.1849 |
Goodness-of-fit parameter for all reflections included in the refinement | 1.019 |
Diffraction radiation wavelength | 1.54178 Å |
Diffraction radiation type | CuKα |