Information card for entry 4343464
Formula | C42 H38 Cl Cu F8 P4 Pd |
Calculated formula | C42 H39 Cl Cu F8 P4 Pd |
Title of publication | Metallophilic Contacts in 2-C6F4PPh2 Bridged Heterobinuclear Complexes: A Crystallographic and Computational Study. |
Authors of publication | Wächtler, Erik; Privér, Steven H; Wagler, Jörg; Heine, Thomas; Zhechkov, Lyuben; Bennett, Martin A.; Bhargava, Suresh K. |
Journal of publication | Inorganic chemistry |
Year of publication | 2015 |
Journal volume | 54 |
Journal issue | 14 |
Pages of publication | 6947 - 6957 |
a | 12.2199 ± 0.0005 Å |
b | 23.9832 ± 0.0011 Å |
c | 14.2228 ± 0.0006 Å |
α | 90° |
β | 90° |
γ | 90° |
Cell volume | 4168.3 ± 0.3 Å3 |
Cell temperature | 150 ± 2 K |
Ambient diffraction temperature | 150 ± 2 K |
Number of distinct elements | 7 |
Space group number | 62 |
Hermann-Mauguin space group symbol | P n m a |
Hall space group symbol | -P 2ac 2n |
Residual factor for all reflections | 0.0495 |
Residual factor for significantly intense reflections | 0.0306 |
Weighted residual factors for significantly intense reflections | 0.061 |
Weighted residual factors for all reflections included in the refinement | 0.0654 |
Goodness-of-fit parameter for all reflections included in the refinement | 1.033 |
Diffraction radiation wavelength | 0.71073 Å |
Diffraction radiation type | MoKα |