Information card for entry 4343465
Formula | C42 H38 Ag Cl F8 P4 Pd |
Calculated formula | C42 H38 Ag Cl F8 P4 Pd |
Title of publication | Metallophilic Contacts in 2-C6F4PPh2 Bridged Heterobinuclear Complexes: A Crystallographic and Computational Study. |
Authors of publication | Wächtler, Erik; Privér, Steven H; Wagler, Jörg; Heine, Thomas; Zhechkov, Lyuben; Bennett, Martin A.; Bhargava, Suresh K. |
Journal of publication | Inorganic chemistry |
Year of publication | 2015 |
Journal volume | 54 |
Journal issue | 14 |
Pages of publication | 6947 - 6957 |
a | 12.1311 ± 0.0016 Å |
b | 24.24 ± 0.003 Å |
c | 14.3081 ± 0.0019 Å |
α | 90° |
β | 90° |
γ | 90° |
Cell volume | 4207.4 ± 0.9 Å3 |
Cell temperature | 191 ± 2 K |
Ambient diffraction temperature | 191 ± 2 K |
Number of distinct elements | 7 |
Space group number | 62 |
Hermann-Mauguin space group symbol | P n m a |
Hall space group symbol | -P 2ac 2n |
Residual factor for all reflections | 0.0494 |
Residual factor for significantly intense reflections | 0.0293 |
Weighted residual factors for significantly intense reflections | 0.0598 |
Weighted residual factors for all reflections included in the refinement | 0.0644 |
Goodness-of-fit parameter for all reflections included in the refinement | 1.03 |
Diffraction radiation wavelength | 0.71073 Å |
Diffraction radiation type | MoKα |