Information card for entry 4343467
Formula | C147 H156 Cu3 F42 O5.25 P15 Pd3 |
Calculated formula | C134 H130 Cu3 F42 O2 P15 Pd3 |
SMILES | [Pd]12([Cu]([P](c3c1c(F)c(F)c(F)c3F)(c1ccccc1)c1ccccc1)([P](c1c2c(F)c(F)c(F)c1F)(c1ccccc1)c1ccccc1)[O]1CCCC1)([P](C)(C)C)[P](C)(C)C.[Pd]12([Cu]([P](c3c1c(F)c(F)c(F)c3F)(c1ccccc1)c1ccccc1)([P](c1c2c(F)c(F)c(F)c1F)(c1ccccc1)c1ccccc1)[O]1CCCC1)([P](C)(C)C)[P](C)(C)C.[Pd]12([Cu]([P](c3c1c(F)c(F)c(F)c3F)(c1ccccc1)c1ccccc1)[P](c1c2c(F)c(F)c(F)c1F)(c1ccccc1)c1ccccc1)([P](C)(C)C)[P](C)(C)C.[P](F)(F)(F)(F)(F)[F-].[P](F)(F)(F)(F)(F)[F-].[P](F)(F)(F)(F)(F)[F-] |
Title of publication | Metallophilic Contacts in 2-C6F4PPh2 Bridged Heterobinuclear Complexes: A Crystallographic and Computational Study. |
Authors of publication | Wächtler, Erik; Privér, Steven H; Wagler, Jörg; Heine, Thomas; Zhechkov, Lyuben; Bennett, Martin A.; Bhargava, Suresh K. |
Journal of publication | Inorganic chemistry |
Year of publication | 2015 |
Journal volume | 54 |
Journal issue | 14 |
Pages of publication | 6947 - 6957 |
a | 11.364 ± 0.003 Å |
b | 36.484 ± 0.009 Å |
c | 36.234 ± 0.01 Å |
α | 90° |
β | 91.993 ± 0.008° |
γ | 90° |
Cell volume | 15014 ± 7 Å3 |
Cell temperature | 151 ± 2 K |
Ambient diffraction temperature | 151 ± 2 K |
Number of distinct elements | 7 |
Space group number | 14 |
Hermann-Mauguin space group symbol | P 1 21/n 1 |
Hall space group symbol | -P 2yn |
Residual factor for all reflections | 0.1006 |
Residual factor for significantly intense reflections | 0.0606 |
Weighted residual factors for significantly intense reflections | 0.137 |
Weighted residual factors for all reflections included in the refinement | 0.151 |
Goodness-of-fit parameter for all reflections included in the refinement | 1 |
Diffraction radiation wavelength | 0.71073 Å |
Diffraction radiation type | MoKα |