Information card for entry 4343466
Formula | C42 H38 Au Cl F8 P4 Pd |
Calculated formula | C42 H38 Au Cl F8 P4 Pd |
Title of publication | Metallophilic Contacts in 2-C6F4PPh2 Bridged Heterobinuclear Complexes: A Crystallographic and Computational Study. |
Authors of publication | Wächtler, Erik; Privér, Steven H; Wagler, Jörg; Heine, Thomas; Zhechkov, Lyuben; Bennett, Martin A.; Bhargava, Suresh K. |
Journal of publication | Inorganic chemistry |
Year of publication | 2015 |
Journal volume | 54 |
Journal issue | 14 |
Pages of publication | 6947 - 6957 |
a | 12.1772 ± 0.001 Å |
b | 24.117 ± 0.002 Å |
c | 14.2573 ± 0.0012 Å |
α | 90° |
β | 90° |
γ | 90° |
Cell volume | 4187 ± 0.6 Å3 |
Cell temperature | 150 ± 2 K |
Ambient diffraction temperature | 150 ± 2 K |
Number of distinct elements | 7 |
Space group number | 62 |
Hermann-Mauguin space group symbol | P n m a |
Hall space group symbol | -P 2ac 2n |
Residual factor for all reflections | 0.0527 |
Residual factor for significantly intense reflections | 0.0337 |
Weighted residual factors for significantly intense reflections | 0.0613 |
Weighted residual factors for all reflections included in the refinement | 0.065 |
Goodness-of-fit parameter for all reflections included in the refinement | 1.01 |
Diffraction radiation wavelength | 0.71073 Å |
Diffraction radiation type | MoKα |