Information card for entry 4343472
Formula | C43 H40 Au2 Cl4 F8 P4 Pd |
Calculated formula | C43 H40 Au2 Cl4 F8 P4 Pd |
SMILES | [Pd]12([Au]([Au](Cl)Cl)([P](c3c1c(F)c(F)c(F)c3F)(c1ccccc1)c1ccccc1)[P](c1c2c(F)c(F)c(F)c1F)(c1ccccc1)c1ccccc1)([P](C)(C)C)[P](C)(C)C.ClCCl |
Title of publication | Metallophilic Contacts in 2-C6F4PPh2 Bridged Heterobinuclear Complexes: A Crystallographic and Computational Study. |
Authors of publication | Wächtler, Erik; Privér, Steven H; Wagler, Jörg; Heine, Thomas; Zhechkov, Lyuben; Bennett, Martin A.; Bhargava, Suresh K. |
Journal of publication | Inorganic chemistry |
Year of publication | 2015 |
Journal volume | 54 |
Journal issue | 14 |
Pages of publication | 6947 - 6957 |
a | 16.2013 ± 0.0008 Å |
b | 17.9786 ± 0.0009 Å |
c | 16.8757 ± 0.0008 Å |
α | 90° |
β | 102.028 ± 0.001° |
γ | 90° |
Cell volume | 4807.6 ± 0.4 Å3 |
Cell temperature | 150 ± 2 K |
Ambient diffraction temperature | 150 ± 2 K |
Number of distinct elements | 7 |
Space group number | 14 |
Hermann-Mauguin space group symbol | P 1 21/c 1 |
Hall space group symbol | -P 2ybc |
Residual factor for all reflections | 0.0438 |
Residual factor for significantly intense reflections | 0.0263 |
Weighted residual factors for significantly intense reflections | 0.0481 |
Weighted residual factors for all reflections included in the refinement | 0.0508 |
Goodness-of-fit parameter for all reflections included in the refinement | 1.04 |
Diffraction radiation wavelength | 0.71073 Å |
Diffraction radiation type | MoKα |