Information card for entry 4343473
Formula | C42 H32 Au Cl F8 P3 Pd |
Calculated formula | C42 H32 Au Cl F8 P3 Pd |
Title of publication | Metallophilic Contacts in 2-C6F4PPh2 Bridged Heterobinuclear Complexes: A Crystallographic and Computational Study. |
Authors of publication | Wächtler, Erik; Privér, Steven H; Wagler, Jörg; Heine, Thomas; Zhechkov, Lyuben; Bennett, Martin A.; Bhargava, Suresh K. |
Journal of publication | Inorganic chemistry |
Year of publication | 2015 |
Journal volume | 54 |
Journal issue | 14 |
Pages of publication | 6947 - 6957 |
a | 14.6768 ± 0.0005 Å |
b | 14.8208 ± 0.0005 Å |
c | 18.3838 ± 0.0007 Å |
α | 90° |
β | 91.444 ± 0.001° |
γ | 90° |
Cell volume | 3997.6 ± 0.2 Å3 |
Cell temperature | 150 ± 2 K |
Ambient diffraction temperature | 150 ± 2 K |
Number of distinct elements | 7 |
Space group number | 14 |
Hermann-Mauguin space group symbol | P 1 21/n 1 |
Hall space group symbol | -P 2yn |
Residual factor for all reflections | 0.0266 |
Residual factor for significantly intense reflections | 0.0185 |
Weighted residual factors for significantly intense reflections | 0.0391 |
Weighted residual factors for all reflections included in the refinement | 0.0406 |
Goodness-of-fit parameter for all reflections included in the refinement | 1.051 |
Diffraction radiation wavelength | 0.71073 Å |
Diffraction radiation type | MoKα |